IPB

ברוך הבא אורח ( התחבר | הירשם )


 
Reply to this topicStart new topic
> בעיה עם AvsP *נפתר*
ShadowRealm
הודעה 23.06.2014, 20:42
הודעה #1


גאנין
סמל קבוצה

קבוצה: רשומים
הודעות: 355
תאריך הצטרפות: 9.07.13
משתמש מספר: 201,026



טוב אז פרמטתי את המחשב לפני כמה זמן~
והורדתי עכשיו AvsP, Avisynth, ו-VirtualDub.

כשאני פותח את ה-AvsP, קופצת ההודעה הזו:



איך מסדרים את זה?

תודה מראש smile.gif

ספוילר:

ציטוט(SirSwagALot @ 23.06.2014, 22:38) *
Just... A stupid, stupid question... Have you tried doing what the error code asks you to do? I know... Insane... But... Have you tried opening the log file? JUSSSTTT amuse us all for a second, do that, and write in here what's written there smile.gif. JUST. FOR THE FUCK. OF IT wink.gif.


כן, ניסיתי לפני שפתחתי את האשכול, ולא הבנתי שום דבר ממה שיש שם.
זה מה שרשום שם:

קוד
Traceback (most recent call last):
  File "run.py", line 5, in <module>
  File "AvsP.pyo", line 73, in <module>
  File "pyavs.pyo", line 31, in <module>
  File "avisynth.pyo", line 4, in <module>
  File "ctypes__init__.pyo", line 415, in __getattr__
  File "ctypes__init__.pyo", line 340, in __init__
WindowsError: [Error 126] The specified module could not be found
Traceback (most recent call last):
  File "run.py", line 5, in <module>
  File "AvsP.pyo", line 73, in <module>
  File "pyavs.pyo", line 31, in <module>
  File "avisynth.pyo", line 4, in <module>
  File "ctypes__init__.pyo", line 415, in __getattr__
  File "ctypes__init__.pyo", line 340, in __init__
WindowsError: [Error 126] The specified module could not be found
Traceback (most recent call last):
  File "run.py", line 5, in <module>
  File "AvsP.pyo", line 73, in <module>
  File "pyavs.pyo", line 31, in <module>
  File "avisynth.pyo", line 4, in <module>
  File "ctypes__init__.pyo", line 415, in __getattr__
  File "ctypes__init__.pyo", line 340, in __init__
WindowsError: [Error 126] The specified module could not be found
Traceback (most recent call last):
  File "run.py", line 5, in <module>
  File "AvsP.pyo", line 73, in <module>
  File "pyavs.pyo", line 31, in <module>
  File "avisynth.pyo", line 4, in <module>
  File "ctypes__init__.pyo", line 415, in __getattr__
  File "ctypes__init__.pyo", line 340, in __init__
WindowsError: [Error 126] The specified module could not be found
Traceback (most recent call last):
  File "run.py", line 5, in <module>
  File "AvsP.pyo", line 73, in <module>
  File "pyavs.pyo", line 31, in <module>
  File "avisynth.pyo", line 4, in <module>
  File "ctypes__init__.pyo", line 415, in __getattr__
  File "ctypes__init__.pyo", line 340, in __init__
WindowsError: [Error 126] The specified module could not be found
Traceback (most recent call last):
  File "run.py", line 5, in <module>
  File "AvsP.pyo", line 73, in <module>
  File "pyavs.pyo", line 31, in <module>
  File "avisynth.pyo", line 4, in <module>
  File "ctypes__init__.pyo", line 415, in __getattr__
  File "ctypes__init__.pyo", line 340, in __init__
WindowsError: [Error 126] The specified module could not be found


ציטוט(SirSwagALot @ 24.06.2014, 19:45) *
ציטוט(ShadowRealm @ 24.06.2014, 18:36) *
ציטוט(SirSwagALot @ 24.06.2014, 17:56) *
you have avisynth installed? Is it avsp or avspmod?


כן, התקנתי avisynth
וזה avsp

get avspmod


כשאני מפעיל את ה-avspmod זה עושה איזה error שאני לא מספיק לקרוא וישר יוצא

עריכה:
לא משנה, מסתבר שבסוף לא התקנתי טוב בהתחלה את avisynth.
עכשיו התקנתי מחדש וזה עובד (:


להשאר עם avspmod או שעדיף לעבוד עם avsp?
מה ההבדל?

ציטוט(SirSwagALot @ 25.06.2014, 17:36) *
http://bit.ly/1sEO3R3

2nd result.
scroll down.
Read up.
Conclude.
Decide.

ALL HAIL ALON.


טוב, תודה <:

הודעה זו נערכה על ידי SirSwagALot: 25.06.2014, 18:12


--------------------
Go to the top of the page
 
+Quote Post

Reply to this topicStart new topic
1 משתמשים נמצאים בנושא זה (1 אורחים ו-0 משתמשים אנונימים)
0 משתמשים:

 



RSS גרסת ארכיון הזמן כרגע: 18.09.2019 , 14:08